Xcode 11 issues

HandBrake for Mac support
Forum rules
An Activity Log is required for support requests. Please read How-to get an activity log? for details on how and why this should be provided.
Post Reply
Nomis101
Posts: 14
Joined: Mon Dec 25, 2017 6:37 pm

Xcode 11 issues

Post by Nomis101 » Sat Jun 08, 2019 11:52 am

Description of problem or question:
I've tried to build HandBrake master with the new Xcode 11 beta. But I'm seeing python issues. I don't think this is an actual HandBrake issue, that's why I'm not opening a bug and ask here instead. I'm not sure if this is something on my toolchain or an Apple bug. With Xcode 10.2.1 everything builds fine. But with the new Xcode 11 beta it stops with

ERROR: download failure; <urlopen error [SSL: CERTIFICATE_VERIFY_FAILED] certificate verify failed: unable to get local issuer certificate

I reinstalled Python 3.7 and I also double clicked on "Install Certificates.command" to install the certificates and even on "Update Shell Profile.command". This didn't help. I also checked that 'export PATH="/Library/Frameworks/Python.framework/Versions/3.7/bin:${PATH}"' is in my .zprofile (and .profile). Switching back to Xcode 10.2.1 and everything is normal. Any clue if this is an Apple bug or something on my toolchain?


HandBrake version (e.g., 1.0.0):
master



Operating system and version (e.g., Ubuntu 16.04 LTS, macOS 10.13 High Sierra, Windows 10 Creators Update):
macOS 10.13 High Sierra



HandBrake Activity Log ***required*** (see How-to get an activity log)

Code: Select all

% ./configure --launch-jobs=1 --force --launch
probe: build tuple...(pass) x86_64-apple-darwin18.6.0
find: ar...(pass) /usr/bin/ar
find: cp...(pass) /bin/cp
find: gcc...(pass) /usr/bin/gcc
find: make...(pass) /usr/bin/make
find: gm4...(pass) /usr/bin/gm4
find: mkdir...(pass) /bin/mkdir
find: gpatch...(pass) /usr/bin/patch
find: rm...(pass) /bin/rm
find: ranlib...(pass) /usr/bin/ranlib
find: strip...(pass) /usr/bin/strip
find: gtar...(pass) /usr/bin/tar
find: nasm...(pass) /usr/local/bin/nasm
find: autoconf...(pass) /usr/local/bin/autoconf
find: automake...(pass) /usr/local/bin/automake
find: cmake...(pass) /usr/local/bin/cmake
find: libtool...(pass) /usr/local/bin/libtool
find: pkg-config...(pass) /usr/local/bin/pkg-config
find: xcodebuild...(pass) /usr/bin/xcodebuild
find: lipo...(pass) /usr/bin/lipo
find: python3...(pass) /Library/Frameworks/Python.framework/Versions/3.7/bin/python3
compute: available architectures...(pass) i386 ppc ppc64 x86_64 [x86_64]
probe: number of CPU cores...(pass) 8
probe: repo info...(pass) https://github.com/HandBrake/HandBrake.git
compute: project data...(pass) HandBrake (developer)
version probe: nasm...(pass) 2.14.02
compute: host tuple...(pass) x86_64-apple-darwin18.6.0
probe: strerror_r...(pass) 
compute: makevar SRC/    = ..
compute: makevar BUILD/  = .
compute: makevar PREFIX/ = /usr/local
compute: makevar XCODE.prefix/ = /Applications
mkdir: ./build
chdir: ./build
write: GNUmakefile
mkdir: project
write: project/handbrake.m4
write: distfile.cfg
-------------------------------------------------------------------------------
Build system:       x86_64-apple-darwin18.6.0
Host system:        x86_64-apple-darwin18.6.0
Target platform:    darwin
Enable FDK-AAC:     False
Enable FFmpeg AAC:  False
Enable NVENC:       False (not supported on target platform)
Enable QSV:         False (not supported on target platform)
Enable VCE:         False (not supported on target platform)
-------------------------------------------------------------------------------
mkdir: log
write: log/build.txt
time begin: Sat Jun  8 13:43:10 2019
launch: /usr/bin/make -j1
-------------------------------------------------------------------------------
  : /usr/bin/xcodebuild -project ../macosx/HandBrake.xcodeproj -target HandBrakeCLI -target HandBrake -configuration release -xcconfig ../macosx/xcconfig/native.xcconfig SYMROOT='/Volumes/Developer/new/HandBrake/build/xroot' CONFIGURATION_BUILD_DIR='/Volumes/Developer/new/HandBrake/build/xroot' CONFIGURATION_TEMP_DIR='/Volumes/Developer/new/HandBrake/build/xroot' EXTERNAL_BUILD='/Volumes/Developer/new/HandBrake/build' EXTERNAL_CONF_ARGS='' EXTERNAL_DRIVER='bootstrap' EXTERNAL_GOALS='' EXTERNAL_JOBS='1' EXTERNAL_VARS='' OTHER_CFLAGS='' build
  : Build settings from command line:
  :     CONFIGURATION_BUILD_DIR = /Volumes/Developer/new/HandBrake/build/xroot
  :     CONFIGURATION_TEMP_DIR = /Volumes/Developer/new/HandBrake/build/xroot
  :     EXTERNAL_BUILD = /Volumes/Developer/new/HandBrake/build
  :     EXTERNAL_CONF_ARGS = 
  :     EXTERNAL_DRIVER = bootstrap
  :     EXTERNAL_GOALS = 
  :     EXTERNAL_JOBS = 1
  :     EXTERNAL_VARS = 
  :     OTHER_CFLAGS = 
  :     SYMROOT = /Volumes/Developer/new/HandBrake/build/xroot
  : 
  : Build settings from configuration file '../macosx/xcconfig/native.xcconfig':
  :     ARCHS = $(NATIVE_ARCH_ACTUAL)
  :     EXTERNAL_XCCONFIG = native
  : 
  : note: Using new build system
  : note: Planning build
  : note: Constructing build description
  : CreateBuildDirectory /Volumes/Developer/new/HandBrake/build/xroot (in target: HandBrakeCLI)
  :     cd /Volumes/Developer/new/HandBrake/macosx
  :     builtin-create-build-directory /Volumes/Developer/new/HandBrake/build/xroot
  : 
  : ExternalBuildToolExecution external (in target: external)
  :     cd /Volumes/Developer/new/HandBrake/macosx
  :     export ACTION=
  :     export ALTERNATE_GROUP=staff
  :     export ALTERNATE_MODE=u+w,go-w,a+rX
  :     export ALTERNATE_OWNER=polysom
  :     export ALWAYS_EMBED_SWIFT_STANDARD_LIBRARIES=NO
  :     export ALWAYS_SEARCH_USER_PATHS=NO
  :     export APPLE_INTERNAL_DEVELOPER_DIR=/AppleInternal/Developer
  :     export APPLE_INTERNAL_DIR=/AppleInternal
  :     export APPLE_INTERNAL_DOCUMENTATION_DIR=/AppleInternal/Documentation
  :     export APPLE_INTERNAL_LIBRARY_DIR=/AppleInternal/Library
  :     export APPLE_INTERNAL_TOOLS=/AppleInternal/Developer/Tools
  :     export APPLICATION_EXTENSION_API_ONLY=NO
  :     export APPLY_RULES_IN_COPY_FILES=NO
  :     export APPLY_RULES_IN_COPY_HEADERS=NO
  :     export ARCHS=x86_64
  :     export ARCHS_STANDARD=x86_64
  :     export ARCHS_STANDARD_32_64_BIT="x86_64 i386"
  :     export ARCHS_STANDARD_32_BIT=i386
  :     export ARCHS_STANDARD_64_BIT=x86_64
  :     export ARCHS_STANDARD_INCLUDING_64_BIT=x86_64
  :     export AVAILABLE_PLATFORMS="appletvos appletvsimulator iphoneos iphonesimulator macosx watchos watchsimulator"
  :     export BITCODE_GENERATION_MODE=marker
  :     export BUILD_ACTIVE_RESOURCES_ONLY=NO
  :     export BUILD_COMPONENTS="headers build"
  :     export BUILD_DIR=/Volumes/Developer/new/HandBrake/build/xroot
  :     export BUILD_LIBRARY_FOR_DISTRIBUTION=NO
  :     export BUILD_ROOT=/Volumes/Developer/new/HandBrake/build/xroot
  :     export BUILD_STYLE=
  :     export BUILD_VARIANTS=normal
  :     export BUILT_PRODUCTS_DIR=/Volumes/Developer/new/HandBrake/build/xroot
  :     export CACHE_ROOT=/var/folders/qh/gtfyt26d59nff_mf4033r7rc0000gn/C/com.apple.DeveloperTools/11.0-11M336w/Xcode
  :     export CLANG_ANALYZER_GCD_PERFORMANCE=YES
  :     export CLANG_ANALYZER_LOCALIZABILITY_EMPTY_CONTEXT=YES
  :     export CLANG_ANALYZER_LOCALIZABILITY_NONLOCALIZED=YES
  :     export CLANG_ANALYZER_NONNULL=YES
  :     export CLANG_ENABLE_MODULES=YES
  :     export CLANG_ENABLE_OBJC_WEAK=YES
  :     export CLANG_MODULES_BUILD_SESSION_FILE=/var/folders/qh/gtfyt26d59nff_mf4033r7rc0000gn/C/org.llvm.clang/ModuleCache.noindex/Session.modulevalidation
  :     export CLANG_WARN_BLOCK_CAPTURE_AUTORELEASING=YES
  :     export CLANG_WARN_BOOL_CONVERSION=YES
  :     export CLANG_WARN_COMMA=YES
  :     export CLANG_WARN_CONSTANT_CONVERSION=YES
  :     export CLANG_WARN_DEPRECATED_OBJC_IMPLEMENTATIONS=YES
  :     export CLANG_WARN_EMPTY_BODY=YES
  :     export CLANG_WARN_ENUM_CONVERSION=YES
  :     export CLANG_WARN_INFINITE_RECURSION=YES
  :     export CLANG_WARN_INT_CONVERSION=YES
  :     export CLANG_WARN_NON_LITERAL_NULL_CONVERSION=YES
  :     export CLANG_WARN_OBJC_IMPLICIT_ATOMIC_PROPERTIES=NO
  :     export CLANG_WARN_OBJC_IMPLICIT_RETAIN_SELF=YES
  :     export CLANG_WARN_OBJC_LITERAL_CONVERSION=YES
  :     export CLANG_WARN_RANGE_LOOP_ANALYSIS=YES
  :     export CLANG_WARN_STRICT_PROTOTYPES=NO
  :     export CLANG_WARN_SUSPICIOUS_MOVE=YES
  :     export CLANG_WARN_UNREACHABLE_CODE=YES
  :     export CLANG_WARN__DUPLICATE_METHOD_MATCH=YES
  :     export CLASS_FILE_DIR=/Volumes/Developer/new/HandBrake/build/xroot/external.build/JavaClasses
  :     export CLONE_HEADERS=NO
  :     export CODE_SIGNING_ALLOWED=YES
  :     export CODE_SIGN_INJECT_BASE_ENTITLEMENTS=YES
  :     export COLOR_DIAGNOSTICS=NO
  :     export COMPILER_INDEX_STORE_ENABLE=Default
  :     export COMPRESS_PNG_FILES=NO
  :     export CONFIGURATION=release
  :     export CONFIGURATION_BUILD_DIR=/Volumes/Developer/new/HandBrake/build/xroot
  :     export CONFIGURATION_TEMP_DIR=/Volumes/Developer/new/HandBrake/build/xroot
  :     export COPYING_PRESERVES_HFS_DATA=NO
  :     export COPY_HEADERS_RUN_UNIFDEF=NO
  :     export COPY_PHASE_STRIP=YES
  :     export CREATE_INFOPLIST_SECTION_IN_BINARY=NO
  :     export DEAD_CODE_STRIPPING=NO
  :     export DEBUGGING_SYMBOLS=YES
  :     export DEBUG_INFORMATION_FORMAT=dwarf-with-dsym
  :     export DEFAULT_COMPILER=com.apple.compilers.llvm.clang.1_0
  :     export DEFAULT_DEXT_INSTALL_PATH=/System/Library/DriverExtensions
  :     export DEFAULT_KEXT_INSTALL_PATH=/System/Library/Extensions
  :     export DEFINES_MODULE=NO
  :     export DEPLOYMENT_LOCATION=NO
  :     export DEPLOYMENT_POSTPROCESSING=NO
  :     export DEPLOYMENT_TARGET_CLANG_ENV_NAME=MACOSX_DEPLOYMENT_TARGET
  :     export DEPLOYMENT_TARGET_CLANG_FLAG_NAME=mmacosx-version-min
  :     export DEPLOYMENT_TARGET_LD_ENV_NAME=MACOSX_DEPLOYMENT_TARGET
  :     export DEPLOYMENT_TARGET_LD_FLAG_NAME=macosx_version_min
  :     export DEPLOYMENT_TARGET_SETTING_NAME=MACOSX_DEPLOYMENT_TARGET
  :     export DERIVED_FILES_DIR=
  :     export DERIVED_FILE_DIR=/Volumes/Developer/new/HandBrake/build/xroot/external.build/DerivedSources
  :     export DERIVED_SOURCES_DIR=/Volumes/Developer/new/HandBrake/build/xroot/external.build/DerivedSources
  :     export DEVELOPER_APPLICATIONS_DIR=/Volumes/Developer/Xcode-beta.app/Contents/Developer/Applications
  :     export DEVELOPER_BIN_DIR=/Volumes/Developer/Xcode-beta.app/Contents/Developer/usr/bin
  :     export DEVELOPER_DIR=/Volumes/Developer/Xcode-beta.app/Contents/Developer
  :     export DEVELOPER_FRAMEWORKS_DIR=/Volumes/Developer/Xcode-beta.app/Contents/Developer/Library/Frameworks
  :     export DEVELOPER_FRAMEWORKS_DIR_QUOTED=/Volumes/Developer/Xcode-beta.app/Contents/Developer/Library/Frameworks
  :     export DEVELOPER_LIBRARY_DIR=/Volumes/Developer/Xcode-beta.app/Contents/Developer/Library
  :     export DEVELOPER_SDK_DIR=/Volumes/Developer/Xcode-beta.app/Contents/Developer/Platforms/MacOSX.platform/Developer/SDKs
  :     export DEVELOPER_TOOLS_DIR=/Volumes/Developer/Xcode-beta.app/Contents/Developer/Tools
  :     export DEVELOPER_USR_DIR=/Volumes/Developer/Xcode-beta.app/Contents/Developer/usr
  :     export DEVELOPMENT_LANGUAGE=en
  :     export DONT_GENERATE_INFOPLIST_FILE=NO
  :     export DO_HEADER_SCANNING_IN_JAM=NO
  :     export DSTROOT=/tmp/HandBrake.dst
  :     export DT_TOOLCHAIN_DIR=/Volumes/Developer/Xcode-beta.app/Contents/Developer/Toolchains/XcodeDefault.xctoolchain
  :     export DWARF_DSYM_FILE_NAME=.dSYM
  :     export DWARF_DSYM_FILE_SHOULD_ACCOMPANY_PRODUCT=NO
  :     export DWARF_DSYM_FOLDER_PATH=/Volumes/Developer/new/HandBrake/build/xroot
  :     export EMBEDDED_CONTENT_CONTAINS_SWIFT=NO
  :     export EMBEDDED_PROFILE_NAME=embedded.provisionprofile
  :     export EMBED_ASSET_PACKS_IN_PRODUCT_BUNDLE=NO
  :     export ENABLE_BITCODE=NO
  :     export ENABLE_DEFAULT_HEADER_SEARCH_PATHS=YES
  :     export ENABLE_HARDENED_RUNTIME=NO
  :     export ENABLE_HEADER_DEPENDENCIES=YES
  :     export ENABLE_ON_DEMAND_RESOURCES=NO
  :     export ENABLE_PREVIEWS=NO
  :     export ENABLE_STRICT_OBJC_MSGSEND=YES
  :     export ENABLE_TESTABILITY=NO
  :     export EXCLUDED_INSTALLSRC_SUBDIRECTORY_PATTERNS=".DS_Store .svn .git .hg CVS"
  :     export EXCLUDED_RECURSIVE_SEARCH_PATH_SUBDIRECTORIES="*.nib *.lproj *.framework *.gch *.xcode* *.xcassets (*) .DS_Store CVS .svn .git .hg *.pbproj *.pbxproj"
  :     export EXTERNAL_BUILD=/Volumes/Developer/new/HandBrake/build
  :     export EXTERNAL_DRIVER=bootstrap
  :     export EXTERNAL_JOBS=1
  :     export EXTERNAL_SRC=..
  :     export EXTERNAL_XCCONFIG=native
  :     export FILE_LIST=/Volumes/Developer/new/HandBrake/build/xroot/external.build/Objects/LinkFileList
  :     export FRAMEWORK_VERSION=A
  :     export GCC3_VERSION=3.3
  :     export GCC_C_LANGUAGE_STANDARD=gnu99
  :     export GCC_ENABLE_OBJC_EXCEPTIONS=YES
  :     export GCC_NO_COMMON_BLOCKS=YES
  :     export GCC_VERSION=com.apple.compilers.llvm.clang.1_0
  :     export GCC_WARN_64_TO_32_BIT_CONVERSION=YES
  :     export GCC_WARN_ABOUT_MISSING_FIELD_INITIALIZERS=YES
  :     export GCC_WARN_ABOUT_MISSING_PROTOTYPES=YES
  :     export GCC_WARN_ABOUT_RETURN_TYPE=YES
  :     export GCC_WARN_FOUR_CHARACTER_CONSTANTS=YES
  :     export GCC_WARN_INITIALIZER_NOT_FULLY_BRACKETED=YES
  :     export GCC_WARN_SHADOW=YES
  :     export GCC_WARN_UNDECLARED_SELECTOR=YES
  :     export GCC_WARN_UNINITIALIZED_AUTOS=YES
  :     export GCC_WARN_UNUSED_FUNCTION=YES
  :     export GCC_WARN_UNUSED_LABEL=YES
  :     export GCC_WARN_UNUSED_VARIABLE=YES
  :     export GENERATE_MASTER_OBJECT_FILE=NO
  :     export GENERATE_PKGINFO_FILE=NO
  :     export GENERATE_PROFILING_CODE=NO
  :     export GENERATE_TEXT_BASED_STUBS=NO
  :     export GID=20
  :     export GROUP=staff
  :     export HEADERMAP_INCLUDES_FLAT_ENTRIES_FOR_TARGET_BEING_BUILT=YES
  :     export HEADERMAP_INCLUDES_FRAMEWORK_ENTRIES_FOR_ALL_PRODUCT_TYPES=YES
  :     export HEADERMAP_INCLUDES_NONPUBLIC_NONPRIVATE_HEADERS=YES
  :     export HEADERMAP_INCLUDES_PROJECT_HEADERS=YES
  :     export HEADERMAP_USES_FRAMEWORK_PREFIX_ENTRIES=YES
  :     export HEADERMAP_USES_VFS=NO
  :     export HIDE_BITCODE_SYMBOLS=YES
  :     export HOME=/Users/polysom
  :     export INFOPLIST_EXPAND_BUILD_SETTINGS=YES
  :     export INFOPLIST_OUTPUT_FORMAT=same-as-input
  :     export INFOPLIST_PREPROCESS=NO
  :     export INLINE_PRIVATE_FRAMEWORKS=NO
  :     export INSTALLHDRS_COPY_PHASE=NO
  :     export INSTALLHDRS_SCRIPT_PHASE=NO
  :     export INSTALL_DIR=/tmp/HandBrake.dst
  :     export INSTALL_GROUP=staff
  :     export INSTALL_MODE_FLAG=u+w,go-w,a+rX
  :     export INSTALL_OWNER=polysom
  :     export INSTALL_ROOT=/tmp/HandBrake.dst
  :     export JAVA_APP_STUB=/System/Library/Frameworks/JavaVM.framework/Resources/MacOS/JavaApplicationStub
  :     export JAVA_ARCHIVE_CLASSES=YES
  :     export JAVA_ARCHIVE_TYPE=JAR
  :     export JAVA_COMPILER=/usr/bin/javac
  :     export JAVA_FRAMEWORK_RESOURCES_DIRS=Resources
  :     export JAVA_JAR_FLAGS=cv
  :     export JAVA_SOURCE_SUBDIR=.
  :     export JAVA_USE_DEPENDENCIES=YES
  :     export JAVA_ZIP_FLAGS=-urg
  :     export KEEP_PRIVATE_EXTERNS=NO
  :     export LD_DEPENDENCY_INFO_FILE=//external_dependency_info.dat
  :     export LD_GENERATE_MAP_FILE=NO
  :     export LD_MAP_FILE_PATH=/Volumes/Developer/new/HandBrake/build/xroot/external.build/external-LinkMap--.txt
  :     export LD_NO_PIE=NO
  :     export LD_QUOTE_LINKER_ARGUMENTS_FOR_COMPILER_DRIVER=YES
  :     export LEGACY_DEVELOPER_DIR=/Volumes/Developer/Xcode-beta.app/Contents/PlugIns/Xcode3Core.ideplugin/Contents/SharedSupport/Developer
  :     export LIBRARY_DEXT_INSTALL_PATH=/Library/DriverExtensions
  :     export LIBRARY_FLAG_NOSPACE=YES
  :     export LIBRARY_KEXT_INSTALL_PATH=/Library/Extensions
  :     export LINKER_DISPLAYS_MANGLED_NAMES=NO
  :     export LINK_FILE_LIST_normal_x86_64=/Volumes/Developer/new/HandBrake/build/xroot/external.build/Objects-normal/x86_64/external.LinkFileList
  :     export LINK_WITH_STANDARD_LIBRARIES=YES
  :     export LLVM_TARGET_TRIPLE_OS_VERSION=macos10.11
  :     export LLVM_TARGET_TRIPLE_VENDOR=apple
  :     export LOCALIZED_STRING_MACRO_NAMES="NSLocalizedString CFLocalizedString HBKitLocalizedString"
  :     export LOCAL_ADMIN_APPS_DIR=/Applications/Utilities
  :     export LOCAL_APPS_DIR=/Applications
  :     export LOCAL_DEVELOPER_DIR=/Library/Developer
  :     export LOCAL_LIBRARY_DIR=/Library
  :     export LOCROOT=/Volumes/Developer/new/HandBrake/macosx
  :     export LOCSYMROOT=/Volumes/Developer/new/HandBrake/macosx
  :     export MACOSX_DEPLOYMENT_TARGET=10.11
  :     export MAC_OS_X_PRODUCT_BUILD_VERSION=18F132
  :     export MAC_OS_X_VERSION_ACTUAL=101405
  :     export MAC_OS_X_VERSION_MAJOR=101400
  :     export MAC_OS_X_VERSION_MINOR=1405
  :     export METAL_LIBRARY_FILE_BASE=default
  :     export METAL_LIBRARY_OUTPUT_DIR=/Volumes/Developer/new/HandBrake/build/xroot/
  :     export MODULES_FOLDER_PATH=/Modules
  :     export NATIVE_ARCH=i386
  :     export NATIVE_ARCH_32_BIT=i386
  :     export NATIVE_ARCH_64_BIT=x86_64
  :     export NATIVE_ARCH_ACTUAL=x86_64
  :     export OBJECT_FILE_DIR=/Volumes/Developer/new/HandBrake/build/xroot/external.build/Objects
  :     export OBJROOT=/Volumes/Developer/new/HandBrake/build/xroot
  :     export ONLY_ACTIVE_ARCH=NO
  :     export OS=MACOS
  :     export OTHER_LDFLAGS="-filelist /Volumes/Developer/new/HandBrake/build/macosx/osl.filelist.txt -lc++"
  :     export PATH=/Volumes/Developer/Xcode-beta.app/Contents/Developer/Toolchains/XcodeDefault.xctoolchain/usr/bin:/Volumes/Developer/Xcode-beta.app/Contents/Developer/Toolchains/XcodeDefault.xctoolchain/usr/local/bin:/Volumes/Developer/Xcode-beta.app/Contents/Developer/Toolchains/XcodeDefault.xctoolchain/usr/libexec:/Volumes/Developer/Xcode-beta.app/Contents/Developer/Platforms/MacOSX.platform/usr/bin:/Volumes/Developer/Xcode-beta.app/Contents/Developer/Platforms/MacOSX.platform/usr/local/bin:/Volumes/Developer/Xcode-beta.app/Contents/Developer/Platforms/MacOSX.platform/Developer/usr/bin:/Volumes/Developer/Xcode-beta.app/Contents/Developer/Platforms/MacOSX.platform/Developer/usr/local/bin:/Volumes/Developer/Xcode-beta.app/Contents/Developer/usr/bin:/Volumes/Developer/Xcode-beta.app/Contents/Developer/usr/local/bin:/Library/Frameworks/Python.framework/Versions/3.7/bin:/Users/polysom/.cargo/bin:/usr/local/bin:/usr/bin:/bin:/usr/sbin:/sbin/Volumes/Developer/Xcode-beta.app/Contents/Developer/usr/bin:/Library/Frameworks/Python.framework/Versions/3.7/bin:/Users/polysom/.cargo/bin:/Users/polysom/.cargo/bin:/Users/polysom/.cargo/bin:/usr/local/bin:/usr/bin:/bin:/usr/sbin:/sbin
  :     export PATH_PREFIXES_EXCLUDED_FROM_HEADER_DEPENDENCIES="/usr/include /usr/local/include /System/Library/Frameworks /System/Library/PrivateFrameworks /Volumes/Developer/Xcode-beta.app/Contents/Developer/Headers /Volumes/Developer/Xcode-beta.app/Contents/Developer/SDKs /Volumes/Developer/Xcode-beta.app/Contents/Developer/Platforms"
  :     export PER_ARCH_OBJECT_FILE_DIR=/
  :     export PLATFORM_DEVELOPER_APPLICATIONS_DIR=/Volumes/Developer/Xcode-beta.app/Contents/Developer/Applications
  :     export PLATFORM_DEVELOPER_BIN_DIR=/Volumes/Developer/Xcode-beta.app/Contents/Developer/usr/bin
  :     export PLATFORM_DEVELOPER_LIBRARY_DIR=/Volumes/Developer/Xcode-beta.app/Contents/Developer/Library
  :     export PLATFORM_DEVELOPER_SDK_DIR=/Volumes/Developer/Xcode-beta.app/Contents/Developer/Platforms/MacOSX.platform/Developer/SDKs
  :     export PLATFORM_DEVELOPER_TOOLS_DIR=/Volumes/Developer/Xcode-beta.app/Contents/Developer/Tools
  :     export PLATFORM_DEVELOPER_USR_DIR=/Volumes/Developer/Xcode-beta.app/Contents/Developer/usr
  :     export PLATFORM_DIR=/Volumes/Developer/Xcode-beta.app/Contents/Developer/Platforms/MacOSX.platform
  :     export PLATFORM_DISPLAY_NAME=macOS
  :     export PLATFORM_NAME=macosx
  :     export PLATFORM_PREFERRED_ARCH=x86_64
  :     export PLATFORM_PRODUCT_BUILD_VERSION=11M336w
  :     export PLIST_FILE_OUTPUT_FORMAT=same-as-input
  :     export PRECOMPS_INCLUDE_HEADERS_FROM_BUILT_PRODUCTS_DIR=YES
  :     export PRECOMP_DESTINATION_DIR=/Volumes/Developer/new/HandBrake/build/xroot/external.build/PrefixHeaders
  :     export PRESERVE_DEAD_CODE_INITS_AND_TERMS=NO
  :     export PRODUCT_MODULE_NAME=external
  :     export PRODUCT_NAME=external
  :     export PROFILING_CODE=NO
  :     export PROJECT=HandBrake
  :     export PROJECT_DERIVED_FILE_DIR=/Volumes/Developer/new/HandBrake/build/xroot/HandBrake.build/DerivedSources
  :     export PROJECT_DIR=/Volumes/Developer/new/HandBrake/macosx
  :     export PROJECT_FILE_PATH=/Volumes/Developer/new/HandBrake/macosx/HandBrake.xcodeproj
  :     export PROJECT_NAME=HandBrake
  :     export PROJECT_TEMP_DIR=/Volumes/Developer/new/HandBrake/build/xroot/HandBrake.build
  :     export PROJECT_TEMP_ROOT=/Volumes/Developer/new/HandBrake/build/xroot
  :     export REMOVE_CVS_FROM_RESOURCES=YES
  :     export REMOVE_GIT_FROM_RESOURCES=YES
  :     export REMOVE_HEADERS_FROM_EMBEDDED_BUNDLES=YES
  :     export REMOVE_HG_FROM_RESOURCES=YES
  :     export REMOVE_SVN_FROM_RESOURCES=YES
  :     export SCAN_ALL_SOURCE_FILES_FOR_INCLUDES=NO
  :     export SDKROOT=/Volumes/Developer/Xcode-beta.app/Contents/Developer/Platforms/MacOSX.platform/Developer/SDKs/MacOSX10.15.sdk
  :     export SEPARATE_STRIP=NO
  :     export SEPARATE_SYMBOL_EDIT=NO
  :     export SHARED_DERIVED_FILE_DIR=/Volumes/Developer/new/HandBrake/build/xroot/DerivedSources
  :     export SHARED_PRECOMPS_DIR=/Volumes/Developer/new/HandBrake/build/xroot/PrecompiledHeaders
  :     export SKIP_INSTALL=YES
  :     export SOURCE_ROOT=/Volumes/Developer/new/HandBrake/macosx
  :     export SRCROOT=/Volumes/Developer/new/HandBrake/macosx
  :     export STRINGS_FILE_OUTPUT_ENCODING=UTF-16
  :     export STRIP_BITCODE_FROM_COPIED_FILES=NO
  :     export STRIP_INSTALLED_PRODUCT=YES
  :     export STRIP_PNG_TEXT=NO
  :     export STRIP_STYLE=all
  :     export STRIP_SWIFT_SYMBOLS=YES
  :     export SUPPORTED_PLATFORMS=macosx
  :     export SUPPORTS_TEXT_BASED_API=NO
  :     export SWIFT_PLATFORM_TARGET_PREFIX=macos
  :     export SWIFT_TARGET_TRIPLE=-apple-macos10.11
  :     export SYMROOT=/Volumes/Developer/new/HandBrake/build/xroot
  :     export SYSTEM_ADMIN_APPS_DIR=/Applications/Utilities
  :     export SYSTEM_APPS_DIR=/Applications
  :     export SYSTEM_CORE_SERVICES_DIR=/System/Library/CoreServices
  :     export SYSTEM_DEMOS_DIR=/Applications/Extras
  :     export SYSTEM_DEVELOPER_APPS_DIR=/Volumes/Developer/Xcode-beta.app/Contents/Developer/Applications
  :     export SYSTEM_DEVELOPER_BIN_DIR=/Volumes/Developer/Xcode-beta.app/Contents/Developer/usr/bin
  :     export SYSTEM_DEVELOPER_DEMOS_DIR="/Volumes/Developer/Xcode-beta.app/Contents/Developer/Applications/Utilities/Built Examples"
  :     export SYSTEM_DEVELOPER_DIR=/Volumes/Developer/Xcode-beta.app/Contents/Developer
  :     export SYSTEM_DEVELOPER_DOC_DIR="/Volumes/Developer/Xcode-beta.app/Contents/Developer/ADC Reference Library"
  :     export SYSTEM_DEVELOPER_GRAPHICS_TOOLS_DIR="/Volumes/Developer/Xcode-beta.app/Contents/Developer/Applications/Graphics Tools"
  :     export SYSTEM_DEVELOPER_JAVA_TOOLS_DIR="/Volumes/Developer/Xcode-beta.app/Contents/Developer/Applications/Java Tools"
  :     export SYSTEM_DEVELOPER_PERFORMANCE_TOOLS_DIR="/Volumes/Developer/Xcode-beta.app/Contents/Developer/Applications/Performance Tools"
  :     export SYSTEM_DEVELOPER_RELEASENOTES_DIR="/Volumes/Developer/Xcode-beta.app/Contents/Developer/ADC Reference Library/releasenotes"
  :     export SYSTEM_DEVELOPER_TOOLS=/Volumes/Developer/Xcode-beta.app/Contents/Developer/Tools
  :     export SYSTEM_DEVELOPER_TOOLS_DOC_DIR="/Volumes/Developer/Xcode-beta.app/Contents/Developer/ADC Reference Library/documentation/DeveloperTools"
  :     export SYSTEM_DEVELOPER_TOOLS_RELEASENOTES_DIR="/Volumes/Developer/Xcode-beta.app/Contents/Developer/ADC Reference Library/releasenotes/DeveloperTools"
  :     export SYSTEM_DEVELOPER_USR_DIR=/Volumes/Developer/Xcode-beta.app/Contents/Developer/usr
  :     export SYSTEM_DEVELOPER_UTILITIES_DIR=/Volumes/Developer/Xcode-beta.app/Contents/Developer/Applications/Utilities
  :     export SYSTEM_DEXT_INSTALL_PATH=/System/Library/DriverExtensions
  :     export SYSTEM_DOCUMENTATION_DIR=/Library/Documentation
  :     export SYSTEM_KEXT_INSTALL_PATH=/System/Library/Extensions
  :     export SYSTEM_LIBRARY_DIR=/System/Library
  :     export TAPI_VERIFY_MODE=ErrorsOnly
  :     export TARGETNAME=external
  :     export TARGET_BUILD_DIR=/Volumes/Developer/new/HandBrake/build/xroot
  :     export TARGET_NAME=external
  :     export TARGET_TEMP_DIR=/Volumes/Developer/new/HandBrake/build/xroot/external.build
  :     export TEMP_DIR=/Volumes/Developer/new/HandBrake/build/xroot/external.build
  :     export TEMP_FILES_DIR=/Volumes/Developer/new/HandBrake/build/xroot/external.build
  :     export TEMP_FILE_DIR=/Volumes/Developer/new/HandBrake/build/xroot/external.build
  :     export TEMP_ROOT=/Volumes/Developer/new/HandBrake/build/xroot
  :     export TOOLCHAIN_DIR=/Volumes/Developer/Xcode-beta.app/Contents/Developer/Toolchains/XcodeDefault.xctoolchain
  :     export TREAT_MISSING_BASELINES_AS_TEST_FAILURES=NO
  :     export UID=501
  :     export USER=polysom
  :     export USER_APPS_DIR=/Users/polysom/Applications
  :     export USER_LIBRARY_DIR=/Users/polysom/Library
  :     export USE_HEADERMAP=YES
  :     export USE_LLVM_TARGET_TRIPLES=YES
  :     export USE_LLVM_TARGET_TRIPLES_FOR_CLANG=YES
  :     export USE_LLVM_TARGET_TRIPLES_FOR_LD=YES
  :     export USE_LLVM_TARGET_TRIPLES_FOR_TAPI=YES
  :     export VALIDATE_DEVELOPMENT_ASSET_PATHS=YES_ERROR
  :     export VALIDATE_WORKSPACE=NO
  :     export VALID_ARCHS="i386 x86_64"
  :     export WRAP_ASSET_PACKS_IN_SEPARATE_DIRECTORIES=NO
  :     export XCODE_APP_SUPPORT_DIR=/Volumes/Developer/Xcode-beta.app/Contents/Developer/Library/Xcode
  :     export XCODE_PRODUCT_BUILD_VERSION=11M336w
  :     export XCODE_VERSION_ACTUAL=1100
  :     export XCODE_VERSION_MAJOR=1100
  :     export XCODE_VERSION_MINOR=1100
  :     export arch=undefined_arch
  :     export variant=normal
  :     /bin/bash ../make/xcodemake
  : target specification: external:
  : reconfiguring (driver bootstrap)
  : Unclobbering PATH:
  :     export PATH="/Volumes/Developer/Xcode-beta.app/Contents/Developer/Toolchains/XcodeDefault.xctoolchain/usr/bin:/Volumes/Developer/Xcode-beta.app/Contents/Developer/Toolchains/XcodeDefault.xctoolchain/usr/local/bin:/Volumes/Developer/Xcode-beta.app/Contents/Developer/Toolchains/XcodeDefault.xctoolchain/usr/libexec:/Volumes/Developer/Xcode-beta.app/Contents/Developer/Platforms/MacOSX.platform/usr/bin:/Volumes/Developer/Xcode-beta.app/Contents/Developer/Platforms/MacOSX.platform/usr/local/bin:/Volumes/Developer/Xcode-beta.app/Contents/Developer/Platforms/MacOSX.platform/Developer/usr/bin:/Volumes/Developer/Xcode-beta.app/Contents/Developer/Platforms/MacOSX.platform/Developer/usr/local/bin:/Volumes/Developer/Xcode-beta.app/Contents/Developer/usr/bin:/Volumes/Developer/Xcode-beta.app/Contents/Developer/usr/local/bin:/Library/Frameworks/Python.framework/Versions/3.7/bin:/Users/polysom/.cargo/bin:/usr/local/bin:/usr/bin:/bin:/usr/sbin:/sbin/Volumes/Developer/Xcode-beta.app/Contents/Developer/usr/bin:/Library/Frameworks/Python.framework/Versions/3.7/bin:/Users/polysom/.cargo/bin:/Users/polysom/.cargo/bin:/Users/polysom/.cargo/bin:/usr/local/bin:/usr/bin:/bin:/usr/sbin:/sbin:/Volumes/Developer/Xcode-beta.app/Contents/Developer/usr/bin"
  : + ../configure --force --build=/Volumes/Developer/new/HandBrake/build --xcode-driver=terminal --xcode-symroot=/Volumes/Developer/new/HandBrake/build/xroot --xcode-config=native --gcc=/Volumes/Developer/Xcode-beta.app/Contents/Developer/Toolchains/XcodeDefault.xctoolchain/usr/bin/clang --arch=x86_64 --sysroot=/Volumes/Developer/Xcode-beta.app/Contents/Developer/Platforms/MacOSX.platform/Developer/SDKs/MacOSX10.15.sdk --minver=10.11
  : probe: build tuple...(pass) x86_64-apple-darwin18.6.0
  : find: ar...(pass) /Volumes/Developer/Xcode-beta.app/Contents/Developer/Toolchains/XcodeDefault.xctoolchain/usr/bin/ar
  : find: cp...(pass) /bin/cp
  : find: gcc...(pass) /Volumes/Developer/Xcode-beta.app/Contents/Developer/usr/bin/gcc
  : find: make...(pass) /Volumes/Developer/Xcode-beta.app/Contents/Developer/usr/bin/make
  : find: gm4...(pass) /Volumes/Developer/Xcode-beta.app/Contents/Developer/Toolchains/XcodeDefault.xctoolchain/usr/bin/gm4
  : find: mkdir...(pass) /bin/mkdir
  : find: gpatch...(pass) /usr/bin/patch
  : find: rm...(pass) /bin/rm
  : find: ranlib...(pass) /Volumes/Developer/Xcode-beta.app/Contents/Developer/Toolchains/XcodeDefault.xctoolchain/usr/bin/ranlib
  : find: strip...(pass) /Volumes/Developer/Xcode-beta.app/Contents/Developer/Toolchains/XcodeDefault.xctoolchain/usr/bin/strip
  : find: gtar...(pass) /usr/bin/tar
  : find: nasm...(pass) /usr/local/bin/nasm
  : find: autoconf...(pass) /usr/local/bin/autoconf
  : find: automake...(pass) /usr/local/bin/automake
  : find: cmake...(pass) /usr/local/bin/cmake
  : find: libtool...(pass) /Volumes/Developer/Xcode-beta.app/Contents/Developer/Toolchains/XcodeDefault.xctoolchain/usr/bin/libtool
  : find: pkg-config...(pass) /usr/local/bin/pkg-config
  : find: xcodebuild...(pass) /Volumes/Developer/Xcode-beta.app/Contents/Developer/usr/bin/xcodebuild
  : find: lipo...(pass) /Volumes/Developer/Xcode-beta.app/Contents/Developer/Toolchains/XcodeDefault.xctoolchain/usr/bin/lipo
  : find: python3...(pass) /Volumes/Developer/Xcode-beta.app/Contents/Developer/usr/bin/python3
  : compute: available architectures...(pass) i386 ppc ppc64 x86_64 [x86_64]
  : probe: number of CPU cores...(pass) 8
  : probe: repo info...(pass) https://github.com/HandBrake/HandBrake.git
  : compute: project data...(pass) HandBrake (developer)
  : version probe: nasm...(pass) 2.14.02
  : compute: host tuple...(pass) x86_64-apple-darwin18.6.0
  : probe: strerror_r...(pass) 
  : compute: makevar SRC/    = /Volumes/Developer/new/HandBrake
  : compute: makevar BUILD/  = .
  : compute: makevar PREFIX/ = /usr/local
  : compute: makevar XCODE.prefix/ = /Applications
  : chdir: /Volumes/Developer/new/HandBrake/build
  : write: GNUmakefile
  : write: project/handbrake.m4
  : write: distfile.cfg
  : -------------------------------------------------------------------------------
  : Build system:       x86_64-apple-darwin18.6.0
  : Host system:        x86_64-apple-darwin18.6.0
  : Target platform:    darwin
  : Enable FDK-AAC:     False
  : Enable FFmpeg AAC:  False
  : Enable NVENC:       False (not supported on target platform)
  : Enable QSV:         False (not supported on target platform)
  : Enable VCE:         False (not supported on target platform)
  : -------------------------------------------------------------------------------
  : Build is configured!
  : You may now cd into /Volumes/Developer/new/HandBrake/build and run make (/Volumes/Developer/Xcode-beta.app/Contents/Developer/usr/bin/make).
  : + exec make -C /Volumes/Developer/new/HandBrake/build XCODE.driver=xcodemake --jobs=1 build
  : /bin/mkdir -p libhb
  : /Volumes/Developer/Xcode-beta.app/Contents/Developer/Toolchains/XcodeDefault.xctoolchain/usr/bin/gm4 -Iproject /Volumes/Developer/new/HandBrake/libhb/project.h.m4 > libhb/project.h
  : /bin/mkdir -p libhb/extras
  : /bin/cp /Volumes/Developer/new/HandBrake/libhb/audio_remap.h libhb/audio_remap.h
  : /bin/cp /Volumes/Developer/new/HandBrake/libhb/audio_resample.h libhb/audio_resample.h
  : /bin/cp /Volumes/Developer/new/HandBrake/libhb/avfilter_priv.h libhb/avfilter_priv.h
  : /bin/cp /Volumes/Developer/new/HandBrake/libhb/bits.h libhb/bits.h
  : /bin/cp /Volumes/Developer/new/HandBrake/libhb/colormap.h libhb/colormap.h
  : /bin/cp /Volumes/Developer/new/HandBrake/libhb/common.h libhb/common.h
  : /bin/cp /Volumes/Developer/new/HandBrake/libhb/compat.h libhb/compat.h
  : /bin/cp /Volumes/Developer/new/HandBrake/libhb/deccc608sub.h libhb/deccc608sub.h
  : /bin/cp /Volumes/Developer/new/HandBrake/libhb/decomb.h libhb/decomb.h
  : /bin/cp /Volumes/Developer/new/HandBrake/libhb/decsrtsub.h libhb/decsrtsub.h
  : /bin/cp /Volumes/Developer/new/HandBrake/libhb/decssasub.h libhb/decssasub.h
  : /bin/cp /Volumes/Developer/new/HandBrake/libhb/dvd.h libhb/dvd.h
  : /bin/cp /Volumes/Developer/new/HandBrake/libhb/eedi2.h libhb/eedi2.h
  : /bin/cp /Volumes/Developer/new/HandBrake/libhb/encx264.h libhb/encx264.h
  : /bin/cp /Volumes/Developer/new/HandBrake/libhb/h264_common.h libhb/h264_common.h
  : /bin/cp /Volumes/Developer/new/HandBrake/libhb/h265_common.h libhb/h265_common.h
  : /bin/cp /Volumes/Developer/new/HandBrake/libhb/hb.h libhb/hb.h
  : /bin/cp /Volumes/Developer/new/HandBrake/libhb/hb_dict.h libhb/hb_dict.h
  : /bin/cp /Volumes/Developer/new/HandBrake/libhb/hb_json.h libhb/hb_json.h
  : /bin/cp /Volumes/Developer/new/HandBrake/libhb/hbavfilter.h libhb/hbavfilter.h
  : /bin/cp /Volumes/Developer/new/HandBrake/libhb/hbffmpeg.h libhb/hbffmpeg.h
  : /bin/cp /Volumes/Developer/new/HandBrake/libhb/hbtypes.h libhb/hbtypes.h
  : /bin/cp /Volumes/Developer/new/HandBrake/libhb/internal.h libhb/internal.h
  : /bin/cp /Volumes/Developer/new/HandBrake/libhb/lang.h libhb/lang.h
  : /bin/cp /Volumes/Developer/new/HandBrake/libhb/nal_units.h libhb/nal_units.h
  : /bin/cp /Volumes/Developer/new/HandBrake/libhb/nlmeans.h libhb/nlmeans.h
  : /bin/cp /Volumes/Developer/new/HandBrake/libhb/nvenc_common.h libhb/nvenc_common.h
  : /bin/cp /Volumes/Developer/new/HandBrake/libhb/param.h libhb/param.h
  : /bin/cp /Volumes/Developer/new/HandBrake/libhb/plist.h libhb/plist.h
  : /bin/cp /Volumes/Developer/new/HandBrake/libhb/ports.h libhb/ports.h
  : /bin/cp /Volumes/Developer/new/HandBrake/libhb/preset.h libhb/preset.h
  : /bin/cp /Volumes/Developer/new/HandBrake/libhb/preset_builtin.h libhb/preset_builtin.h
  : /bin/cp /Volumes/Developer/new/HandBrake/libhb/qsv_common.h libhb/qsv_common.h
  : /bin/cp /Volumes/Developer/new/HandBrake/libhb/qsv_filter.h libhb/qsv_filter.h
  : /bin/cp /Volumes/Developer/new/HandBrake/libhb/qsv_filter_pp.h libhb/qsv_filter_pp.h
  : /bin/cp /Volumes/Developer/new/HandBrake/libhb/qsv_libav.h libhb/qsv_libav.h
  : /bin/cp /Volumes/Developer/new/HandBrake/libhb/qsv_memory.h libhb/qsv_memory.h
  : /bin/cp /Volumes/Developer/new/HandBrake/libhb/ssautil.h libhb/ssautil.h
  : /bin/cp /Volumes/Developer/new/HandBrake/libhb/taskset.h libhb/taskset.h
  : /bin/cp /Volumes/Developer/new/HandBrake/libhb/vce_common.h libhb/vce_common.h
  : /bin/cp /Volumes/Developer/new/HandBrake/libhb/extras/cl.h libhb/extras/cl.h
  : /bin/cp /Volumes/Developer/new/HandBrake/libhb/extras/cl_platform.h libhb/extras/cl_platform.h
  : /bin/mkdir -p /Volumes/Developer/new/HandBrake/download
  : ERROR: download failure; <urlopen error [SSL: CERTIFICATE_VERIFY_FAILED] certificate verify failed: unable to get local issuer certificate (_ssl.c:1056)>; continuing.
  : ERROR: download failure; <urlopen error [SSL: CERTIFICATE_VERIFY_FAILED] certificate verify failed: unable to get local issuer certificate (_ssl.c:1056)>; stop.
  : downloading https://download.handbrake.fr/contrib/libvpx-1.8.0.tar.gz to /Volumes/Developer/new/HandBrake/download/libvpx-1.8.0.tar.gz
  : downloading https://github.com/webmproject/libvpx/archive/v1.8.0.tar.gz to /Volumes/Developer/new/HandBrake/download/libvpx-1.8.0.tar.gz
  : make[1]: *** [/Volumes/Developer/new/HandBrake/download/libvpx-1.8.0.tar.gz] Error 1
  : Command ExternalBuildToolExecution failed with a nonzero exit code
  : 
  : SymLink /Volumes/Developer/new/HandBrake/build/xroot/HandBrakeKit.framework/HandBrakeKit Versions/Current/HandBrakeKit (in target: HandBrakeKit)
  :     cd /Volumes/Developer/new/HandBrake/macosx
  :     /bin/ln -sfh Versions/Current/HandBrakeKit /Volumes/Developer/new/HandBrake/build/xroot/HandBrakeKit.framework/HandBrakeKit
  : 
  : SymLink /Volumes/Developer/new/HandBrake/build/xroot/HandBrakeKit.framework/Headers Versions/Current/Headers (in target: HandBrakeKit)
  :     cd /Volumes/Developer/new/HandBrake/macosx
  :     /bin/ln -sfh Versions/Current/Headers /Volumes/Developer/new/HandBrake/build/xroot/HandBrakeKit.framework/Headers
  : 
  : SymLink /Volumes/Developer/new/HandBrake/build/xroot/HandBrakeKit.framework/Modules Versions/Current/Modules (in target: HandBrakeKit)
  :     cd /Volumes/Developer/new/HandBrake/macosx
  :     /bin/ln -sfh Versions/Current/Modules /Volumes/Developer/new/HandBrake/build/xroot/HandBrakeKit.framework/Modules
  : 
  : SymLink /Volumes/Developer/new/HandBrake/build/xroot/HandBrakeKit.framework/Resources Versions/Current/Resources (in target: HandBrakeKit)
  :     cd /Volumes/Developer/new/HandBrake/macosx
  :     /bin/ln -sfh Versions/Current/Resources /Volumes/Developer/new/HandBrake/build/xroot/HandBrakeKit.framework/Resources
  : 
  : SymLink /Volumes/Developer/new/HandBrake/build/xroot/HandBrakeKit.framework/PrivateHeaders Versions/Current/PrivateHeaders (in target: HandBrakeKit)
  :     cd /Volumes/Developer/new/HandBrake/macosx
  :     /bin/ln -sfh Versions/Current/PrivateHeaders /Volumes/Developer/new/HandBrake/build/xroot/HandBrakeKit.framework/PrivateHeaders
  : 
  : SymLink /Volumes/Developer/new/HandBrake/build/xroot/HandBrakeKit.framework/Versions/Current A (in target: HandBrakeKit)
  :     cd /Volumes/Developer/new/HandBrake/macosx
  :     /bin/ln -sfh A /Volumes/Developer/new/HandBrake/build/xroot/HandBrakeKit.framework/Versions/Current
  : 
  : MkDir /Volumes/Developer/new/HandBrake/build/xroot/HandBrakeKit.framework/Versions/A/Resources (in target: HandBrakeKit)
  :     cd /Volumes/Developer/new/HandBrake/macosx
  :     /bin/mkdir -p /Volumes/Developer/new/HandBrake/build/xroot/HandBrakeKit.framework/Versions/A/Resources
  : 
  : MkDir /Volumes/Developer/new/HandBrake/build/xroot/HandBrakeKit.framework/Versions/A/Headers (in target: HandBrakeKit)
  :     cd /Volumes/Developer/new/HandBrake/macosx
  :     /bin/mkdir -p /Volumes/Developer/new/HandBrake/build/xroot/HandBrakeKit.framework/Versions/A/Headers
  : 
  : MkDir /Volumes/Developer/new/HandBrake/build/xroot/HandBrakeKit.framework/Versions/A (in target: HandBrakeKit)
  :     cd /Volumes/Developer/new/HandBrake/macosx
  :     /bin/mkdir -p /Volumes/Developer/new/HandBrake/build/xroot/HandBrakeKit.framework/Versions/A
  : 
  : MkDir /Volumes/Developer/new/HandBrake/build/xroot/HandBrakeKit.framework/Versions/A/PrivateHeaders (in target: HandBrakeKit)
  :     cd /Volumes/Developer/new/HandBrake/macosx
  :     /bin/mkdir -p /Volumes/Developer/new/HandBrake/build/xroot/HandBrakeKit.framework/Versions/A/PrivateHeaders
  : 
  : MkDir /Volumes/Developer/new/HandBrake/build/xroot/HandBrakeKit.framework/Versions (in target: HandBrakeKit)
  :     cd /Volumes/Developer/new/HandBrake/macosx
  :     /bin/mkdir -p /Volumes/Developer/new/HandBrake/build/xroot/HandBrakeKit.framework/Versions
  : 
  : MkDir /Volumes/Developer/new/HandBrake/build/xroot/HandBrakeKit.framework (in target: HandBrakeKit)
  :     cd /Volumes/Developer/new/HandBrake/macosx
  :     /bin/mkdir -p /Volumes/Developer/new/HandBrake/build/xroot/HandBrakeKit.framework
  : 
  : MkDir /Volumes/Developer/new/HandBrake/build/xroot/HandBrake.app/Contents (in target: HandBrake)
  :     cd /Volumes/Developer/new/HandBrake/macosx
  :     /bin/mkdir -p /Volumes/Developer/new/HandBrake/build/xroot/HandBrake.app/Contents
  : 
  : MkDir /Volumes/Developer/new/HandBrake/build/xroot/HandBrake.app (in target: HandBrake)
  :     cd /Volumes/Developer/new/HandBrake/macosx
  :     /bin/mkdir -p /Volumes/Developer/new/HandBrake/build/xroot/HandBrake.app
  : 
  : MkDir /Volumes/Developer/new/HandBrake/build/xroot/HandBrake.app/Contents/MacOS (in target: HandBrake)
  :     cd /Volumes/Developer/new/HandBrake/macosx
  :     /bin/mkdir -p /Volumes/Developer/new/HandBrake/build/xroot/HandBrake.app/Contents/MacOS
  : 
  : MkDir /Volumes/Developer/new/HandBrake/build/xroot/HandBrake.app/Contents/XPCServices (in target: HandBrake)
  :     cd /Volumes/Developer/new/HandBrake/macosx
  :     /bin/mkdir -p /Volumes/Developer/new/HandBrake/build/xroot/HandBrake.app/Contents/XPCServices
  : 
  : MkDir /Volumes/Developer/new/HandBrake/build/xroot/HandBrake.app/Contents/Frameworks (in target: HandBrake)
  :     cd /Volumes/Developer/new/HandBrake/macosx
  :     /bin/mkdir -p /Volumes/Developer/new/HandBrake/build/xroot/HandBrake.app/Contents/Frameworks
  : 
  : MkDir /Volumes/Developer/new/HandBrake/build/xroot/HandBrake.app/Contents/Resources (in target: HandBrake)
  :     cd /Volumes/Developer/new/HandBrake/macosx
  :     /bin/mkdir -p /Volumes/Developer/new/HandBrake/build/xroot/HandBrake.app/Contents/Resources
  : 
  : ** BUILD FAILED **
  : 
  : 
  : The following build commands failed:
  : 	ExternalBuildToolExecution external
  : (1 failure)
  : make: *** [macosx.build] Error 65
-------------------------------------------------------------------------------
time end: Sat Jun  8 13:43:19 2019
duration: 8 seconds (8.47s)
result: FAILURE (code 2)
-------------------------------------------------------------------------------
Build is finished!
You may now cd into ./build and examine the output.

Post Reply